Target
Sigma non-opioid intracellular receptor 1
Ligand
BDBM50010790
Substrate
Meas. Tech.
ChEMBL_201719 (CHEMBL803917)
IC50
42±n/a nM
Citation
 Scherz, MWFialeix, MFischer, JBReddy, NLServer, ACSonders, MSTester, BCWeber, EWong, STKeana, JF Synthesis and structure-activity relationships of N,N'-di-o-tolylguanidine analogues, high-affinity ligands for the haloperidol-sensitive sigma receptor. J Med Chem 33:2421-9 (1990)  
Target
Name:
Sigma non-opioid intracellular receptor 1
Synonyms:
Aging-associated gene 8 protein SGMR1_HUMAN SIGMAR1 SR31747-binding protein Sigma 1-type opioid receptor Sigma1R | hSigmaR1
Type:
Enzyme Catalytic Domain
Mol. Mass.:
25124.85
Organism:
Homo sapiens (Human)
Description:
Q99720
Residue:
223
  
Inhibitor
Name:
BDBM50010790
Synonyms:
CHEMBL78637 | N-(2,6-Dimethyl-phenyl)-N'-o-tolyl-guanidine
Type:
Small organic molecule
Emp. Form.:
C16H19N3
Mol. Mass.:
253.3422
SMILES:
Cc1ccccc1NC(N)=Nc1c(C)cccc1C
: