Target
Mu-type opioid receptor
Ligand
BDBM50008857
Substrate
Meas. Tech.
ChEMBL_145290 (CHEMBL854793)
Ki
864±n/a nM
Citation
 Halfpenny, PRHorwell, DCHughes, JHumblet, CHunter, JCNeuhaus, DRees, DC Highly selective kappa opioid analgesics. 4. Synthesis of some conformationally restricted naphthalene derivatives with high receptor affinity and selectivity. J Med Chem 34:190-4 (1991)  
Target
Name:
Mu-type opioid receptor
Synonyms:
M-OR-1 Mu opioid receptor OPIATE Mu OPRM_CAVPO
Type:
Enzyme Catalytic Domain
Mol. Mass.:
11165.58
Organism:
GUINEA PIG
Description:
P97266
Residue:
98
  
Inhibitor
Name:
BDBM50008857
Synonyms:
CHEMBL543329 | N-Methyl-2-naphthalen-1-yl-N-(7-pyrrolidin-1-yl-1-oxa-spiro[4.5]dec-8-yl)-acetamide; hydrochloride
Type:
Small organic molecule
Emp. Form.:
C26H34N2O2
Mol. Mass.:
406.5604
SMILES:
CN([C@H]1CCC2(CCCO2)C[C@@H]1N1CCCC1)C(=O)Cc1cccc2ccccc12
: