Target
Kappa-type opioid receptor
Ligand
BDBM50008855
Substrate
Meas. Tech.
ChEBML_145227
Ki
11.1±n/a nM
Citation
 Halfpenny, PRHorwell, DCHughes, JHumblet, CHunter, JCNeuhaus, DRees, DC Highly selective kappa opioid analgesics. 4. Synthesis of some conformationally restricted naphthalene derivatives with high receptor affinity and selectivity. J Med Chem 34:190-4 (1991)  
Target
Name:
Kappa-type opioid receptor
Synonyms:
Kappa Opioid Receptor OPRK1 Opiate Kappa 1 | mu/kappa opioid receptor
Type:
G Protein-Coupled Receptor (GPCR)
Mol. Mass.:
42744.99
Organism:
Cavia porcellus (domestic guinea pig)
Description:
P41144
Residue:
380
  
Inhibitor
Name:
BDBM50008855
Synonyms:
4,5-Dihydro-3H-naphtho[1,8-bc]thiophene-5-carboxylic acid methyl-(7-pyrrolidin-1-yl-1-oxa-spiro[4.5]dec-8-yl)-amide; compound with toluene-4-sulfonic acid | CHEMBL300831
Type:
Small organic molecule
Emp. Form.:
C26H34N2O2S
Mol. Mass.:
438.625
SMILES:
CN([C@H]1CCC2(CCCO2)C[C@@H]1N1CCCC1)C(=O)C1CCc2csc3cccc1c23
: