Target
Dihydrofolate reductase
Ligand
BDBM50367055
Substrate
Meas. Tech.
ChEBML_54214
IC50
25±n/a nM
Citation
 Rosowsky, AForsch, RAMoran, RGFreisheim, JH Synthesis and biological activity of the 2-desamino and 2-desamino-2-methyl analogues of aminopterin and methotrexate. J Med Chem 34:227-34 (1991)  
Target
Name:
Dihydrofolate reductase
Synonyms:
DHFR Dihydrofolate reductase (DHFR) | Tetrahydrofolate dehydrogenase
Type:
Enzyme
Mol. Mass.:
21453.99
Organism:
Homo sapiens (Human)
Description:
Recombinant human DHFR.
Residue:
187
  
Inhibitor
Name:
BDBM50367055
Synonyms:
4-Aminofolic acid AMINOPTERIN | Aminopteroylglutamic acid
Type:
Small organic molecule
Emp. Form.:
C19H20N8O5
Mol. Mass.:
440.4127
SMILES:
Nc1nc(N)c2nc(CNc3ccc(cc3)C(=O)N[C@@H](CCC(O)=O)C(O)=O)cnc2n1
: