Target
Gastrin/cholecystokinin type B receptor
Ligand
BDBM50005823
Substrate
Meas. Tech.
ChEMBL_48264 (CHEMBL663169)
IC50
330±n/a nM
Citation
 Horwell, DCHughes, JHunter, JCPritchard, MCRichardson, RSRoberts, EWoodruff, GN Rationally designed"dipeptoid" analogues of CCK. alpha-Methyltryptophan derivatives as highly selective and orally active gastrin and CCK-B antagonists with potent anxiolytic properties. J Med Chem 34:404-14 (1991)  
Target
Name:
Gastrin/cholecystokinin type B receptor
Synonyms:
Cckbr Cholecystokinin receptor Gastrin/cholecystokinin type B receptor
Type:
Enzyme Catalytic Domain
Mol. Mass.:
49196.59
Organism:
MOUSE
Description:
Cholecystokinin A CCKBR MOUSE::P56481
Residue:
453
  
Inhibitor
Name:
BDBM50005823
Synonyms:
CHEMBL291033 | [2-(1H-Indol-3-yl)-1-methyl-1-phenethylcarbamoyl-ethyl]-carbamic acid adamantan-2-yl ester
Type:
Small organic molecule
Emp. Form.:
C31H37N3O3
Mol. Mass.:
499.6438
SMILES:
CC(Cc1c[nH]c2ccccc12)(NC(=O)OC1[C@H]2C[C@@H]3C[C@@H](C[C@H]1C3)C2)C(=O)NCCc1ccccc1
: