Target
Cholecystokinin receptor type A
Ligand
BDBM50007436
Substrate
Meas. Tech.
ChEMBL_50177 (CHEMBL662392)
IC50
740±n/a nM
Citation
 Horwell, DCHughes, JHunter, JCPritchard, MCRichardson, RSRoberts, EWoodruff, GN Rationally designed"dipeptoid" analogues of CCK. alpha-Methyltryptophan derivatives as highly selective and orally active gastrin and CCK-B antagonists with potent anxiolytic properties. J Med Chem 34:404-14 (1991)  
Target
Name:
Cholecystokinin receptor type A
Synonyms:
CCKAR_RAT Cholecystokinin peripheral Cholecystokinin receptor type A
Type:
Enzyme Catalytic Domain
Mol. Mass.:
49676.37
Organism:
RAT
Description:
Cholecystokinin central 0 RAT::P30551
Residue:
444
  
Inhibitor
Name:
BDBM50007436
Synonyms:
CHEMBL334346 | Succinic acid mono-{2-[2-(adamantan-2-yloxycarbonylamino)-3-(1H-indol-3-yl)-2-methyl-propionylamino]-3-phenyl-propyl} ester
Type:
Small organic molecule
Emp. Form.:
C36H43N3O7
Mol. Mass.:
629.7425
SMILES:
C[C@](Cc1c[nH]c2ccccc12)(NC(=O)OC1[C@H]2C[C@@H]3C[C@@H](C[C@H]1C3)C2)C(=O)N[C@H](COC(=O)CCC(O)=O)Cc1ccccc1
: