Target
3-hydroxy-3-methylglutaryl-coenzyme A reductase
Ligand
BDBM50011203
Substrate
Meas. Tech.
ChEBML_80653
IC50
26±n/a nM
Citation
 Roth, BDBocan, TMBlankley, CJChucholowski, AWCreger, PLCreswell, MWFerguson, ENewton, RSO'Brien, PPicard, JA Relationship between tissue selectivity and lipophilicity for inhibitors of HMG-CoA reductase. J Med Chem 34:463-6 (1991)  
Target
Name:
3-hydroxy-3-methylglutaryl-coenzyme A reductase
Synonyms:
HMDH_RAT Hmgcr
Type:
Enzyme
Mol. Mass.:
96689.85
Organism:
Rattus norvegicus (rat)
Description:
Isolated rat liver microsomes were used as enzyme source.
Residue:
887
  
Inhibitor
Name:
BDBM50011203
Synonyms:
CHEMBL3349880 | Sodium; 7-[3,4-dibromo-2-(4-fluoro-phenyl)-5-isopropyl-pyrrol-1-yl]-3,5-dihydroxy-heptanoate
Type:
Small organic molecule
Emp. Form.:
C20H23Br2FNNaO4
Mol. Mass.:
543.197
SMILES:
[Na+].CC(C)c1c(Br)c(Br)c(-c2ccc(F)cc2)n1CC[C@@H](O)C[C@@H](O)CC([O-])=O
: