Target
3-hydroxy-3-methylglutaryl-coenzyme A reductase
Ligand
BDBM50011204
Substrate
Meas. Tech.
ChEBML_80653
IC50
2±n/a nM
Citation
 Roth, BDBocan, TMBlankley, CJChucholowski, AWCreger, PLCreswell, MWFerguson, ENewton, RSO'Brien, PPicard, JA Relationship between tissue selectivity and lipophilicity for inhibitors of HMG-CoA reductase. J Med Chem 34:463-6 (1991)  
Target
Name:
3-hydroxy-3-methylglutaryl-coenzyme A reductase
Synonyms:
HMDH_RAT Hmgcr
Type:
Enzyme
Mol. Mass.:
96689.85
Organism:
Rattus norvegicus (rat)
Description:
Isolated rat liver microsomes were used as enzyme source.
Residue:
887
  
Inhibitor
Name:
BDBM50011204
Synonyms:
CHEMBL2368094 | Sodium; 7-[4-(4-fluoro-phenyl)-2-isopropyl-6-phenyl-pyridin-3-yl]-3,5-dihydroxy-hept-6-enoate
Type:
Small organic molecule
Emp. Form.:
C27H27FNNaO4
Mol. Mass.:
471.4958
SMILES:
[Na+].CC(C)c1nc(cc(-c2ccc(F)cc2)c1\C=C\[C@@H](O)C[C@@H](O)CC([O-])=O)-c1ccccc1
: