Target
3-hydroxy-3-methylglutaryl-coenzyme A reductase
Ligand
BDBM50011205
Substrate
Meas. Tech.
ChEBML_80653
IC50
100±n/a nM
Citation
 Roth, BDBocan, TMBlankley, CJChucholowski, AWCreger, PLCreswell, MWFerguson, ENewton, RSO'Brien, PPicard, JA Relationship between tissue selectivity and lipophilicity for inhibitors of HMG-CoA reductase. J Med Chem 34:463-6 (1991)  
Target
Name:
3-hydroxy-3-methylglutaryl-coenzyme A reductase
Synonyms:
HMDH_RAT Hmgcr
Type:
Enzyme
Mol. Mass.:
96689.85
Organism:
Rattus norvegicus (rat)
Description:
Isolated rat liver microsomes were used as enzyme source.
Residue:
887
  
Inhibitor
Name:
BDBM50011205
Synonyms:
CHEMBL3349882 | Sodium; 6-(4''-fluoro-4'-isopropyl-4-methyl-[1,1';2',1'']terphenyl-3'-yloxy)-3,5-dihydroxy-hexanoate
Type:
Small organic molecule
Emp. Form.:
C28H30FNaO5
Mol. Mass.:
488.523
SMILES:
[Na+].CC(C)c1ccc(-c2ccc(C)cc2)c(-c2ccc(F)cc2)c1OC[C@@H](O)C[C@@H](O)CC([O-])=O
: