Target
3-hydroxy-3-methylglutaryl-coenzyme A reductase
Ligand
BDBM50011212
Substrate
Meas. Tech.
ChEBML_80653
IC50
141±n/a nM
Citation
 Roth, BDBocan, TMBlankley, CJChucholowski, AWCreger, PLCreswell, MWFerguson, ENewton, RSO'Brien, PPicard, JA Relationship between tissue selectivity and lipophilicity for inhibitors of HMG-CoA reductase. J Med Chem 34:463-6 (1991)  
Target
Name:
3-hydroxy-3-methylglutaryl-coenzyme A reductase
Synonyms:
HMDH_RAT Hmgcr
Type:
Enzyme
Mol. Mass.:
96689.85
Organism:
Rattus norvegicus (rat)
Description:
Isolated rat liver microsomes were used as enzyme source.
Residue:
887
  
Inhibitor
Name:
BDBM50011212
Synonyms:
CHEMBL3349879 | Sodium; 6-(2-cycloheptyl-4,6-dimethyl-phenoxy)-3,5-dihydroxy-hexanoate
Type:
Small organic molecule
Emp. Form.:
C21H31NaO5
Mol. Mass.:
386.4576
SMILES:
[Na+].Cc1cc(C)c(OC[C@@H](O)C[C@@H](O)CC([O-])=O)c(c1)C1CCCCCC1
: