Target
3-hydroxy-3-methylglutaryl-coenzyme A reductase
Ligand
BDBM50007254
Substrate
Meas. Tech.
ChEBML_80660
IC50
1000±n/a nM
Citation
 Jendralla, HGranzer, Evon Kerekjarto, BKrause, RSchacht, UBaader, EBartmann, WBeck, GBergmann, AKesseler, K Synthesis and biological activity of new HMG-CoA reductase inhibitors. 3. Lactones of 6-phenoxy-3,5-dihydroxyhexanoic acids. J Med Chem 34:2962-83 (1991)  
Target
Name:
3-hydroxy-3-methylglutaryl-coenzyme A reductase
Synonyms:
HMDH_RAT Hmgcr
Type:
Enzyme
Mol. Mass.:
96689.85
Organism:
Rattus norvegicus (rat)
Description:
Isolated rat liver microsomes were used as enzyme source.
Residue:
887
  
Inhibitor
Name:
BDBM50007254
Synonyms:
CHEMBL103139 | Sodium; 6-[2-(4-fluoro-phenyl)-4-methyl-quinolin-3-yloxy]-3,5-dihydroxy-hexanoate
Type:
Small organic molecule
Emp. Form.:
C22H21FNO5
Mol. Mass.:
398.4048
SMILES:
Cc1c(OCC(O)C[C@@H](O)CC([O-])=O)c(nc2ccccc12)-c1ccc(F)cc1
: