Target
3-hydroxy-3-methylglutaryl-coenzyme A reductase
Ligand
BDBM50007265
Substrate
Meas. Tech.
ChEBML_78556
IC50
>5000±n/a nM
Citation
 Jendralla, HGranzer, Evon Kerekjarto, BKrause, RSchacht, UBaader, EBartmann, WBeck, GBergmann, AKesseler, K Synthesis and biological activity of new HMG-CoA reductase inhibitors. 3. Lactones of 6-phenoxy-3,5-dihydroxyhexanoic acids. J Med Chem 34:2962-83 (1991)  
Target
Name:
3-hydroxy-3-methylglutaryl-coenzyme A reductase
Synonyms:
3-hydroxy-3-methylglutaryl-coenzyme A (HMG-CoA) reductase HMDH_HUMAN HMG-CoA reductase (HMGR) | HMGCR
Type:
Enzyme
Mol. Mass.:
97477.10
Organism:
Homo sapiens (Human)
Description:
P04035
Residue:
888
  
Inhibitor
Name:
BDBM50007265
Synonyms:
CHEMBL102112 | Sodium; 3,5-dihydroxy-6-(2-methyl-4-phenyl-quinolin-3-yloxy)-hexanoate
Type:
Small organic molecule
Emp. Form.:
C22H22NO5
Mol. Mass.:
380.4143
SMILES:
Cc1nc2ccccc2c(-c2ccccc2)c1OCC(O)C[C@@H](O)CC([O-])=O
: