Target
3-hydroxy-3-methylglutaryl-coenzyme A reductase
Ligand
BDBM50007277
Substrate
Meas. Tech.
ChEBML_78556
IC50
4.1±n/a nM
Citation
 Jendralla, HGranzer, Evon Kerekjarto, BKrause, RSchacht, UBaader, EBartmann, WBeck, GBergmann, AKesseler, K Synthesis and biological activity of new HMG-CoA reductase inhibitors. 3. Lactones of 6-phenoxy-3,5-dihydroxyhexanoic acids. J Med Chem 34:2962-83 (1991)  
Target
Name:
3-hydroxy-3-methylglutaryl-coenzyme A reductase
Synonyms:
3-hydroxy-3-methylglutaryl-coenzyme A (HMG-CoA) reductase HMDH_HUMAN HMG-CoA reductase (HMGR) | HMGCR
Type:
Enzyme
Mol. Mass.:
97477.10
Organism:
Homo sapiens (Human)
Description:
P04035
Residue:
888
  
Inhibitor
Name:
BDBM50007277
Synonyms:
CHEMBL177545 | Sodium;6-(4'-Fluoro-6-hydroxy-2,4,5-triisopropyl-biphenyl-3-yloxy)-3,5-dihydroxy-hexanoic acid anion;Sodium acetyl
Type:
Small organic molecule
Emp. Form.:
C27H36FO6
Mol. Mass.:
475.5701
SMILES:
CC(C)c1c(O)c(-c2ccc(F)cc2)c(C(C)C)c(OC[C@@H](O)C[C@@H](O)CC([O-])=O)c1C(C)C
: