Target
Sodium-dependent dopamine transporter
Ligand
BDBM50451132
Substrate
Meas. Tech.
ChEBML_61489
IC50
15±n/a nM
Citation
 Neumeyer, JLWang, SYMilius, RABaldwin, RMZea-Ponce, YHoffer, PBSybirska, Eal-Tikriti, MCharney, DSMalison, RT [123I]-2 beta-carbomethoxy-3 beta-(4-iodophenyl)tropane: high-affinity SPECT radiotracer of monoamine reuptake sites in brain. J Med Chem 34:3144-6 (1991)  
Target
Name:
Sodium-dependent dopamine transporter
Synonyms:
DA transporter SC6A3_RAT Sodium-dependent dopamine transporter | Sodium-dependent dopamine transporter (DAT)
Type:
Multi-pass membrane protein
Mol. Mass.:
68749.45
Organism:
Rattus norvegicus (rat)
Description:
P23977
Residue:
619
  
Inhibitor
Name:
BDBM50451132
Synonyms:
CHEMBL2079586 | WIN-35428
Type:
Small organic molecule
Emp. Form.:
C16H20FNO2
Mol. Mass.:
277.3339
SMILES:
[H][C@@]12CC[C@]([H])([C@H]([C@H](C1)c1ccc(F)cc1)C(=O)OC)N2C
: