Target
Kappa-type opioid receptor
Ligand
BDBM50007337
Substrate
Meas. Tech.
ChEBML_145801
IC50
322±n/a nM
Citation
 Barlow, JJBlackburn, TPCostello, GFJames, RLe Count, DJMain, BGPearce, RJRussell, KShaw, JS Structure/activity studies related to 2-(3,4-dichlorophenyl)-N-methyl-N-[2-(1-pyrrolidinyl)-1-substituted- ethyl]acetamides: a novel series of potent and selective kappa-opioid agonists. J Med Chem 34:3149-58 (1991)  
Target
Name:
Kappa-type opioid receptor
Synonyms:
Kappa Opioid Receptor OPRK1 Opiate Kappa 1 | mu/kappa opioid receptor
Type:
G Protein-Coupled Receptor (GPCR)
Mol. Mass.:
42744.99
Organism:
Cavia porcellus (domestic guinea pig)
Description:
P41144
Residue:
380
  
Inhibitor
Name:
BDBM50007337
Synonyms:
CHEMBL106726 | N-Ethyl-N-(2-methyl-1-pyrrolidin-1-ylmethyl-propyl)-2-phenyl-acetamide
Type:
Small organic molecule
Emp. Form.:
C19H30N2O
Mol. Mass.:
302.4543
SMILES:
CCN([C@H](CN1CCCC1)C(C)C)C(=O)Cc1ccccc1
: