Target
Kappa-type opioid receptor
Ligand
BDBM50007361
Substrate
Meas. Tech.
ChEMBL_145202 (CHEMBL753519)
IC50
53±n/a nM
Citation
 Barlow, JJBlackburn, TPCostello, GFJames, RLe Count, DJMain, BGPearce, RJRussell, KShaw, JS Structure/activity studies related to 2-(3,4-dichlorophenyl)-N-methyl-N-[2-(1-pyrrolidinyl)-1-substituted- ethyl]acetamides: a novel series of potent and selective kappa-opioid agonists. J Med Chem 34:3149-58 (1991)  
Target
Name:
Kappa-type opioid receptor
Synonyms:
Kappa Opioid Receptor OPRK1 Opiate Kappa 1 | mu/kappa opioid receptor
Type:
G Protein-Coupled Receptor (GPCR)
Mol. Mass.:
42744.99
Organism:
Cavia porcellus (domestic guinea pig)
Description:
P41144
Residue:
380
  
Inhibitor
Name:
BDBM50007361
Synonyms:
2-(3,4-Dichloro-phenyl)-N-methyl-N-(1-methyl-2-pyrrolidin-1-yl-ethyl)-acetamide | CHEMBL56651
Type:
Small organic molecule
Emp. Form.:
C16H22Cl2N2O
Mol. Mass.:
329.265
SMILES:
C[C@@H](CN1CCCC1)N(C)C(=O)Cc1ccc(Cl)c(Cl)c1
: