Target
Aldo-keto reductase family 1 member B1
Ligand
BDBM16312
Substrate
Meas. Tech.
ChEMBL_92451 (CHEMBL878705)
IC50
990±n/a nM
Citation
 DuPriest, MTGriffin, BWKuzmich, DMcNatt, LG Spiro[fluoreneisothiazolidin]one dioxides: new aldose reductase and L-hexonate dehydrogenase inhibitors. J Med Chem 34:3229-34 (1991)  
Target
Name:
Aldo-keto reductase family 1 member B1
Synonyms:
ALDR_RAT Akr1b4 Aldr1
Type:
PROTEIN
Mol. Mass.:
35797.87
Organism:
Rattus norvegicus
Description:
ChEMBL_1512484
Residue:
316
  
Inhibitor
Name:
BDBM16312
Synonyms:
(4S)-6-fluoro-2,3-dihydrospiro[1-benzopyran-4,4'-imidazolidine]-2',5'-dione Sorbinil
Type:
Small organic molecule
Emp. Form.:
C11H9FN2O3
Mol. Mass.:
236.1992
SMILES:
Fc1ccc2OCC[C@]3(NC(=O)NC3=O)c2c1
: