Target
D(1A) dopamine receptor
Ligand
BDBM50010300
Substrate
Meas. Tech.
ChEBML_60185
Ki
340±n/a nM
Citation
 Bakthavachalam, VBaindur, NMadras, BKNeumeyer, JL Fluorescent probes for dopamine receptors: synthesis and characterization of fluorescein and 7-nitrobenz-2-oxa-1,3-diazol-4-yl conjugates of D-1 and D-2 receptor ligands. J Med Chem 34:3235-41 (1991)  
Target
Name:
D(1A) dopamine receptor
Synonyms:
DA D1 receptor DRD1 Dopamine D1 receptor Dopamine D1A
Type:
Enzyme
Mol. Mass.:
49303.43
Organism:
Homo sapiens (Human)
Description:
P21728
Residue:
446
  
Inhibitor
Name:
BDBM50010300
Synonyms:
(RS)3',6'-dihydroxy-5-[4-{2-[5-hydroxy-1,2,3,4-tetrahydro-2-naphthalenyl(propyl)amino]ethyl}anilino(thioxo)methylamino]spiro[1,3-dihydroisobenzofuran-1,9'-(9'H-xanthene)]-3-one | CHEMBL320526
Type:
Small organic molecule
Emp. Form.:
C42H39N3O6S
Mol. Mass.:
713.841
SMILES:
CCCN(CCc1ccc(NC(=S)Nc2ccc3c(c2)C(=O)OC32c3ccc(O)cc3Oc3cc(O)ccc23)cc1)C1CCc2c(O)cccc2C1
: