Target
D(1A) dopamine receptor
Ligand
BDBM50007700
Substrate
Meas. Tech.
ChEMBL_60357 (CHEMBL672092)
Ki
1.2±n/a nM
Citation
 Neumeyer, JLBaindur, NNiznik, HBGuan, HCSeeman, P (+/-)-3-Allyl-6-bromo-7,8-dihydroxy-1-phenyl-2,3,4,5-tetrahydro-1H-3- benzazepin, a new high-affinity D1 dopamine receptor ligand: synthesis and structure-activity relationship. J Med Chem 34:3366-71 (1992)  
Target
Name:
D(1A) dopamine receptor
Synonyms:
DA D1 receptor DRD1 Dopamine D1 receptor Dopamine D1A
Type:
Enzyme
Mol. Mass.:
49303.43
Organism:
Homo sapiens (Human)
Description:
P21728
Residue:
446
  
Inhibitor
Name:
BDBM50007700
Synonyms:
6-Bromo-3-methyl-1-phenyl-2,3,4,5-tetrahydro-1H-benzo[d]azepine-7,8-diol; hydrobromide | CHEMBL554009
Type:
Small organic molecule
Emp. Form.:
C17H18BrNO2
Mol. Mass.:
348.234
SMILES:
CN1CCc2c(Br)c(O)c(O)cc2C(C1)c1ccccc1
: