Target
Acetylcholinesterase
Ligand
BDBM50008685
Substrate
Meas. Tech.
ChEBML_29086
IC50
900±n/a nM
Citation
 Kozikowski, APMiller, CPYamada, FPang, YPMiller, JHMcKinney, MBall, RG Delineating the pharmacophoric elements of huperzine A: importance of the unsaturated three-carbon bridge to its AChE inhibitory activity. J Med Chem 34:3399-402 (1992)  
Target
Name:
Acetylcholinesterase
Synonyms:
ACES_RAT Acetylcholinesterase and butyrylcholinesterase (AChE and BChE) Acetylcholinesterase, AChE | Ache
Type:
Enzyme
Mol. Mass.:
68193.62
Organism:
Rattus norvegicus (rat)
Description:
P37136
Residue:
614
  
Inhibitor
Name:
BDBM50008685
Synonyms:
1-Amino-13-ethylidene-11-methyl-6-aza-tricyclo[7.3.1.0*2,7*]trideca-2(7),3-dien-5-one | CHEMBL115350
Type:
Small organic molecule
Emp. Form.:
C15H20N2O
Mol. Mass.:
244.3321
SMILES:
C\C=C1/C2CC(C)C[C@]1(N)c1ccc(=O)[nH]c1C2
: