Target
5-hydroxytryptamine receptor 1A
Ligand
BDBM50011251
Substrate
Meas. Tech.
ChEBML_1534
Ki
32±n/a nM
Citation
 Mellin, CVallgårda, JNelson, DLBjörk, LYu, HAndén, NECsöregh, IArvidsson, LEHacksell, U A 3-D model for 5-HT1A-receptor agonists based on stereoselective methyl-substituted and conformationally restricted analogues of 8-hydroxy-2-(dipropylamino)tetralin. J Med Chem 34:497-510 (1991)  
Target
Name:
5-hydroxytryptamine receptor 1A
Synonyms:
5-HT-1A 5-HT1A 5-hydroxytryptamine receptor 1A (5HT1A) 5ht1a Htr1a Serotonin 1a (5-HT1a) receptor/Adrenergic receptor alpha-1 | Serotonin receptor 1A
Type:
G Protein-Coupled Receptor (GPCR)
Mol. Mass.:
46445.29
Organism:
Rattus norvegicus (rat)
Description:
Binding assays were performed using rat hippocampal membranes.
Residue:
422
  
Inhibitor
Name:
BDBM50011251
Synonyms:
4-Propyl-1,2,3,4,4a,5,6,10b-octahydro-benzo[f]quinolin-10-ol; hydrochloride | CHEMBL539325
Type:
Small organic molecule
Emp. Form.:
C16H23NO
Mol. Mass.:
245.3599
SMILES:
CCCN1CCC[C@H]2[C@H]1CCc1cccc(O)c21
: