Target
Adenosylhomocysteinase
Ligand
BDBM50144936
Substrate
Meas. Tech.
ChEBML_196865
Ki
30000±n/a nM
Citation
 Jarvi, ETMcCarthy, JRMehdi, SMatthews, DPEdwards, MLPrakash, NJBowlin, TLSunkara, PSBey, P 4',5'-unsaturated 5'-halogenated nucleosides. Mechanism-based and competitive inhibitors of S-adenosyl-L-homocysteine hydrolase. J Med Chem 34:647-56 (1991)  
Target
Name:
Adenosylhomocysteinase
Synonyms:
Adenosylhomocysteinase Ahcy Liver copper-binding protein SAHH_MOUSE
Type:
PROTEIN
Mol. Mass.:
47687.65
Organism:
Mus musculus
Description:
ChEMBL_196559
Residue:
432
  
Inhibitor
Name:
BDBM50144936
Synonyms:
CHEMBL1090 adenine arabinoside
Type:
Small organic molecule
Emp. Form.:
C10H13N5O4
Mol. Mass.:
267.2413
SMILES:
Nc1ncnc2n(cnc12)[C@@H]1O[C@H](CO)[C@@H](O)[C@@H]1O
: