Target
Angiotensin-converting enzyme
Ligand
BDBM50011362
Substrate
Meas. Tech.
ChEBML_34788
IC50
1.5±n/a nM
Citation
 Pascard, CGuilhem, JVincent, MRémond, GPortevin, BLaubie, M Configuration and preferential solid-state conformations of perindoprilat (S-9780). Comparison with the crystal structures of other ACE inhibitors and conclusions related to structure-activity relationships. J Med Chem 34:663-9 (1991)  
Target
Name:
Angiotensin-converting enzyme
Synonyms:
3.2.1.- ACE Angiotensin-converting enzyme, soluble form DCP1 Kininase II
Type:
Mol. Mass.:
150405.15
Organism:
Oryctolagus cuniculus
Description:
Residue:
1310
  
Inhibitor
Name:
BDBM50011362
Synonyms:
1-(3-Mercapto-2-methyl-propionyl)-pyrrolidine-2-carboxylic acid | CHEMBL161170
Type:
Small organic molecule
Emp. Form.:
C9H15NO3S
Mol. Mass.:
217.285
SMILES:
C[C@@H](CS)C(=O)N1CCCC1C(O)=O
: