Target
Aldo-keto reductase family 1 member A1
Ligand
BDBM16314
Substrate
Meas. Tech.
ChEMBL_31308 (CHEMBL646326)
IC50
540±n/a nM
Citation
 Mylari, BLBeyer, TASiegel, TW A highly specific aldose reductase inhibitor, ethyl 1-benzyl-3-hydroxy-2(5H)-oxopyrrole-4-carboxylate, and its congeners. J Med Chem 34:1011-8 (1991)  
Target
Name:
Aldo-keto reductase family 1 member A1
Synonyms:
AK1A1_PIG ALR Aldehyde reductase
Type:
PROTEIN
Mol. Mass.:
36557.09
Organism:
Sus scrofa
Description:
ChEMBL_615076
Residue:
325
  
Inhibitor
Name:
BDBM16314
Synonyms:
2-{[6-methoxy-5-(trifluoromethyl)naphthalen-1-yl]-N-methylmethanethioamido}acetic acid CHEMBL436 Tolrestat
Type:
Small organic molecule
Emp. Form.:
C16H14F3NO3S
Mol. Mass.:
357.347
SMILES:
COc1ccc2c(cccc2c1C(F)(F)F)C(=S)N(C)CC(O)=O
: