Target
D(2) dopamine receptor
Ligand
BDBM50007505
Substrate
Meas. Tech.
ChEMBL_58709 (CHEMBL669055)
IC50
2900±n/a nM
Citation
 Hrib, NJJurcak, JGHuger, FPErrico, CLDunn, RW Synthesis and biological evaluation of a series of substituted N-alkoxyimides and -amides as potential atypical antipsychotic agents. J Med Chem 34:1068-72 (1991)  
Target
Name:
D(2) dopamine receptor
Synonyms:
DOPAMINE D2 DOPAMINE D2 Short Dopamine D2 receptor Drd2
Type:
G Protein-Coupled Receptor (GPCR)
Mol. Mass.:
50931.60
Organism:
Rattus norvegicus (rat)
Description:
P61169
Residue:
444
  
Inhibitor
Name:
BDBM50007505
Synonyms:
8-{3-[4-(3-Trifluoromethyl-phenyl)-piperazin-1-yl]-propoxy}-8-aza-spiro[4.5]decane-7,9-dione(HCl) | CHEMBL10355
Type:
Small organic molecule
Emp. Form.:
C23H30F3N3O3
Mol. Mass.:
453.4978
SMILES:
FC(F)(F)c1cccc(c1)N1CCN(CCCON2C(=O)CC3(CCCC3)CC2=O)CC1
: