Target
Sigma non-opioid intracellular receptor 1
Ligand
BDBM50022721
Substrate
Meas. Tech.
ChEBML_201270
Ki
46400±n/a nM
Citation
 Glennon, RASmith, JDIsmaiel, AMel-Ashmawy, MBattaglia, GFischer, JB Identification and exploitation of the sigma-opiate pharmacophore. J Med Chem 34:1094-8 (1991)  
Target
Name:
Sigma non-opioid intracellular receptor 1
Synonyms:
Aging-associated gene 8 protein SGMR1_HUMAN SIGMAR1 SR31747-binding protein Sigma 1-type opioid receptor Sigma1R | hSigmaR1
Type:
Enzyme Catalytic Domain
Mol. Mass.:
25124.85
Organism:
Homo sapiens (Human)
Description:
Q99720
Residue:
223
  
Inhibitor
Name:
BDBM50022721
Synonyms:
(R)-amphetamine CHEMBL19393
Type:
Small organic molecule
Emp. Form.:
C9H13N
Mol. Mass.:
135.2062
SMILES:
C[C@@H](N)Cc1ccccc1
: