Target
Prostaglandin-H2 D-isomerase
Ligand
BDBM50368231
Substrate
Meas. Tech.
ChEBML_158157
IC50
8000±n/a nM
Citation
 Bell, MRD'Ambra, TEKumar, VEissenstat, MAHerrmann, JLWetzel, JRRosi, DPhilion, REDaum, SJHlasta, DJ Antinociceptive (aminoalkyl)indoles. J Med Chem 34:1099-110 (1991)  
Target
Name:
Prostaglandin-H2 D-isomerase
Synonyms:
PTGDS_MOUSE | Ptgds
Type:
PROTEIN
Mol. Mass.:
21069.88
Organism:
Mus musculus
Description:
ChEMBL_158158
Residue:
189
  
Inhibitor
Name:
BDBM50368231
Synonyms:
CHEMBL337134
Type:
Small organic molecule
Emp. Form.:
C23H25FN2O2
Mol. Mass.:
380.4552
SMILES:
C[C@@H](CN1CCOCC1)n1c(C)c(C(=O)c2ccccc2F)c2ccccc12
: