Target
Prostaglandin-H2 D-isomerase
Ligand
BDBM50009853
Substrate
Meas. Tech.
ChEBML_158157
IC50
1400±n/a nM
Citation
 Bell, MRD'Ambra, TEKumar, VEissenstat, MAHerrmann, JLWetzel, JRRosi, DPhilion, REDaum, SJHlasta, DJ Antinociceptive (aminoalkyl)indoles. J Med Chem 34:1099-110 (1991)  
Target
Name:
Prostaglandin-H2 D-isomerase
Synonyms:
PTGDS_MOUSE | Ptgds
Type:
PROTEIN
Mol. Mass.:
21069.88
Organism:
Mus musculus
Description:
ChEMBL_158158
Residue:
189
  
Inhibitor
Name:
BDBM50009853
Synonyms:
2-[3-(2-Fluoro-benzoyl)-2-methyl-indol-1-yl]-propionic acid | CHEMBL13319
Type:
Small organic molecule
Emp. Form.:
C19H16FNO3
Mol. Mass.:
325.3336
SMILES:
CC(C(O)=O)n1c(C)c(C(=O)c2ccccc2F)c2ccccc12
: