Target
Adenosine receptor A1
Ligand
BDBM82031
Substrate
Meas. Tech.
ChEMBL_29276 (CHEMBL640337)
EC50
1148±n/a nM
Citation
 Ueeda, MThompson, RDArroyo, LHOlsson, RA 2-Alkoxyadenosines: potent and selective agonists at the coronary artery A2 adenosine receptor. J Med Chem 34:1334-9 (1991)  
Target
Name:
Adenosine receptor A1
Synonyms:
A1 adenosine receptor ADENOSINE A1 ADENOSINE A1 low Adenosine A1 receptor | Adenosine Receptor A1
Type:
Enzyme Catalytic Domain
Mol. Mass.:
36501.39
Organism:
GUINEA PIG
Description:
ADENOSINE A1 ADORA1 GUINEA PIG::P47745
Residue:
326
  
Inhibitor
Name:
BDBM82031
Synonyms:
2-Oxoado (isoguanosine) isoguanosine
Type:
Small organic molecule
Emp. Form.:
C10H13N5O5
Mol. Mass.:
283.2407
SMILES:
Nc1[nH]c(=O)nc2n(cnc12)[C@@H]1O[C@H](CO)[C@@H](O)[C@H]1O
: