Target
Thymidylate synthase
Ligand
BDBM50012047
Substrate
Meas. Tech.
ChEBML_209797
IC50
1850±n/a nM
Citation
 Marsham, PRHughes, LRJackman, ALHayter, AJOldfield, JWardleworth, JMBishop, JAO'Connor, BMCalvert, AH Quinazoline antifolate thymidylate synthase inhibitors: heterocyclic benzoyl ring modifications. J Med Chem 34:1594-605 (1991)  
Target
Name:
Thymidylate synthase
Synonyms:
TS TYSY_MOUSE | Tyms
Type:
PROTEIN
Mol. Mass.:
34957.15
Organism:
Mus musculus
Description:
ChEMBL_1340097
Residue:
307
  
Inhibitor
Name:
BDBM50012047
Synonyms:
2-({5-[(2-Methyl-4-oxo-3,4-dihydro-quinazolin-6-ylmethyl)-propyl-amino]-thiophene-2-carbonyl}-amino)-pentanedioic acid | CHEMBL288307
Type:
Small organic molecule
Emp. Form.:
C23H26N4O6S
Mol. Mass.:
486.541
SMILES:
CCCN(Cc1ccc2nc(C)[nH]c(=O)c2c1)c1ccc(s1)C(=O)N[C@H](CCC(O)=O)C(O)=O
: