Target
Delta-type opioid receptor
Ligand
BDBM50009194
Substrate
Meas. Tech.
ChEMBL_146586 (CHEMBL754820)
IC50
2.4±n/a nM
Citation
 Salvadori, SMarastoni, MBalboni, GBorea, PAMorari, MTomatis, R Synthesis and structure-activity relationships of deltorphin analogues. J Med Chem 34:1656-61 (1991)  
Target
Name:
Delta-type opioid receptor
Synonyms:
Cytochrome P450 3A4 Delta opioid receptor Delta-type opioid receptor (DOR) OPRD_RAT Opioid receptor Opioid receptors; mu & delta Ror-a | Voltage-gated potassium channel
Type:
G Protein-Coupled Receptor (GPCR)
Mol. Mass.:
40465.04
Organism:
Rattus norvegicus (rat)
Description:
Competition binding assays were using CHO-K1 cell membranes expressing the opioid receptor.
Residue:
372
  
Inhibitor
Name:
BDBM50009194
Synonyms:
2-(2-{2-[2-(2-{2-[2-Amino-3-(4-hydroxy-phenyl)-propionylamino]-4-methylsulfanyl-butyrylamino}-3-phenyl-propionylamino)-3-(3H-imidazol-4-yl)-propionylamino]-4-methyl-pentanoylamino}-4-methylsulfanyl-butyrylamino)-succinic acid | CHEMBL45308
Type:
Small organic molecule
Emp. Form.:
C44H61N9O11S2
Mol. Mass.:
956.139
SMILES:
CSCC[C@H](NC(=O)[C@@H](N)Cc1ccc(O)cc1)C(=O)N[C@@H](Cc1ccccc1)C(=O)N[C@@H](Cc1cnc[nH]1)C(=O)N[C@@H](CC(C)C)C(=O)N[C@@H](CCSC)C(=O)N[C@@H](CC(O)=O)C(O)=O
: