Target
Mu-type opioid receptor
Ligand
BDBM50009187
Substrate
Meas. Tech.
ChEMBL_146982 (CHEMBL757521)
IC50
100±n/a nM
Citation
 Salvadori, SMarastoni, MBalboni, GBorea, PAMorari, MTomatis, R Synthesis and structure-activity relationships of deltorphin analogues. J Med Chem 34:1656-61 (1991)  
Target
Name:
Mu-type opioid receptor
Synonyms:
M-OR-1 Mu opioid receptor OPIATE Mu OPRM_CAVPO
Type:
Enzyme Catalytic Domain
Mol. Mass.:
11165.58
Organism:
GUINEA PIG
Description:
P97266
Residue:
98
  
Inhibitor
Name:
BDBM50009187
Synonyms:
3-(2-{2-[2-(2-{2-[2-Amino-3-(4-hydroxy-phenyl)-propionylamino]-4-methylsulfanyl-butyrylamino}-3-phenyl-propionylamino)-acetylamino]-4-methyl-pentanoylamino}-4-methylsulfanyl-butyrylamino)-succinamic acid | CHEMBL289537
Type:
Small organic molecule
Emp. Form.:
C40H58N8O10S2
Mol. Mass.:
875.066
SMILES:
CSCC[C@H](NC(=O)[C@@H](N)Cc1ccc(O)cc1)C(=O)N[C@@H](Cc1ccccc1)C(=O)NCC(=O)N[C@@H](CC(C)C)C(=O)N[C@@H](CCSC)C(=O)N[C@@H](CC(O)=O)C(N)=O
: