Target
Mu-type opioid receptor
Ligand
BDBM50009193
Substrate
Meas. Tech.
ChEBML_146537
IC50
3200±n/a nM
Citation
 Salvadori, SMarastoni, MBalboni, GBorea, PAMorari, MTomatis, R Synthesis and structure-activity relationships of deltorphin analogues. J Med Chem 34:1656-61 (1991)  
Target
Name:
Mu-type opioid receptor
Synonyms:
MOR-1 Mu-type opioid receptor (MOR) OPRM_RAT Opioid receptor B Ror-b
Type:
G Protein-Coupled Receptor (GPCR)
Mol. Mass.:
44503.11
Organism:
Rattus norvegicus (rat)
Description:
Competition binding assays were carried out using membrane preparations from transfected HN9.10 cells that constitutively expressed the mu opioid receptor.
Residue:
398
  
Inhibitor
Name:
BDBM50009193
Synonyms:
(S)-4-((S)-2-{(S)-2-[(S)-2-Amino-3-(4-hydroxy-phenyl)-propionylamino]-propionylamino}-3-phenyl-propionylamino)-4-{(S)-1-[(S)-1-(carbamoylmethyl-carbamoyl)-2-methyl-propylcarbamoyl]-2-methyl-propylcarbamoyl}-butyric acid 4-(2-{2-[(2-Amino-6-hydroxy-1,2,3,4-tetrahydro-naphthalene-2-carbonyl)-amino]-propionylamino}-3-phenyl-propionylamino)-4-{1-[1-(carbamoylmethyl-carbamoyl)-2-methyl-butylcarbamoyl]-2-methyl-butylcarbamoyl}-butyric acid CHEMBL29078 Tyr-D-Ala-Phe-Glu-Val-Val-Gly-NH2
Type:
Small organic molecule
Emp. Form.:
C38H54N8O10
Mol. Mass.:
782.883
SMILES:
CC(C)[C@H](NC(=O)[C@@H](NC(=O)[C@H](CCC(O)=O)NC(=O)[C@H](Cc1ccccc1)NC(=O)[C@H](C)NC(=O)[C@@H](N)Cc1ccc(O)cc1)C(C)C)C(=O)NCC(N)=O
: