Target
Substance-P receptor
Ligand
BDBM50009231
Substrate
Meas. Tech.
ChEMBL_208655 (CHEMBL811431)
IC50
1100±n/a nM
Citation
 Appell, KCBabb, BEGoswami, RHall, PLLawrence, KBLogan, MEPrzyklek-Elling, RTomczuk, BEVenepalli, BRYanni, JM Imidazo[4,5-b]quinoxaline cyanines as neurokinin antagonists. J Med Chem 34:1751-3 (1991)  
Target
Name:
Substance-P receptor
Synonyms:
NK-1 receptor NK1 Receptor Neurokinin 1 receptor SPR Tac1r Tacr1
Type:
G Protein-Coupled Receptor (GPCR)
Mol. Mass.:
46371.54
Organism:
Rattus norvegicus (rat)
Description:
Competition binding assays were carried out using membrane preparations from transfected CHO cells that constitutively expressed the rat NK1 receptor.
Residue:
407
  
Inhibitor
Name:
BDBM50009231
Synonyms:
6,7-Dichloro-1,3-diethyl-2-[3-(1,3,3-trimethyl-1,3-dihydro-indol-2-ylidene)-propenyl]-3H-imidazo[4,5-b]quinoxalin-1-ium; chloride | CHEMBL301168
Type:
Small organic molecule
Emp. Form.:
C27H28Cl2N5
Mol. Mass.:
493.45
SMILES:
CCn1c(\C=C\C=C2\N(C)c3ccccc3C2(C)C)[n+](CC)c2nc3cc(Cl)c(Cl)cc3nc12
: