Target
Substance-P receptor
Ligand
BDBM50009238
Substrate
Meas. Tech.
ChEMBL_208655 (CHEMBL811431)
IC50
>10000±n/a nM
Citation
 Appell, KCBabb, BEGoswami, RHall, PLLawrence, KBLogan, MEPrzyklek-Elling, RTomczuk, BEVenepalli, BRYanni, JM Imidazo[4,5-b]quinoxaline cyanines as neurokinin antagonists. J Med Chem 34:1751-3 (1991)  
Target
Name:
Substance-P receptor
Synonyms:
NK-1 receptor NK1 Receptor Neurokinin 1 receptor SPR Tac1r Tacr1
Type:
G Protein-Coupled Receptor (GPCR)
Mol. Mass.:
46371.54
Organism:
Rattus norvegicus (rat)
Description:
Competition binding assays were carried out using membrane preparations from transfected CHO cells that constitutively expressed the rat NK1 receptor.
Residue:
407
  
Inhibitor
Name:
BDBM50009238
Synonyms:
1,3-Diethyl-2-(4-pyrrolidin-1-yl-buta-1,3-dienyl)-3H-imidazo[4,5-b]quinoxalin-1-ium; iodide | CHEMBL296134
Type:
Small organic molecule
Emp. Form.:
C21H26N5
Mol. Mass.:
348.4641
SMILES:
CCn1c(\C=C\C=C\N2CCCC2)[n+](CC)c2nc3ccccc3nc12
: