Target
Mu-type opioid receptor
Ligand
BDBM50453050
Substrate
Meas. Tech.
ChEMBL_148850 (CHEMBL756646)
Ki
240±n/a nM
Citation
 Hruby, VJToth, GGehrig, CAKao, LFKnapp, RLui, GKYamamura, HIKramer, THDavis, PBurks, TF Topographically designed analogues of [D-Pen,D-Pen5]enkephalin. J Med Chem 34:1823-30 (1991)  
Target
Name:
Mu-type opioid receptor
Synonyms:
MOR-1 Mu-type opioid receptor (MOR) OPRM_RAT Opioid receptor B Ror-b
Type:
G Protein-Coupled Receptor (GPCR)
Mol. Mass.:
44503.11
Organism:
Rattus norvegicus (rat)
Description:
Competition binding assays were carried out using membrane preparations from transfected HN9.10 cells that constitutively expressed the mu opioid receptor.
Residue:
398
  
Inhibitor
Name:
BDBM50453050
Synonyms:
CHEMBL2115466
Type:
Small organic molecule
Emp. Form.:
C31H40N6O9S2
Mol. Mass.:
704.814
SMILES:
[H][C@@]1(NC(=O)CNC(=O)[C@@H](NC(=O)[C@@H](N)Cc2ccc(O)cc2)C(C)(C)SSC(C)(C)[C@H](NC1=O)C(O)=O)[C@@H](C)c1ccc(cc1)[N+]([O-])=O
: