Target
Delta-type opioid receptor
Ligand
BDBM50453048
Substrate
Meas. Tech.
ChEMBL_145892 (CHEMBL754258)
IC50
27500±n/a nM
Citation
 Hruby, VJToth, GGehrig, CAKao, LFKnapp, RLui, GKYamamura, HIKramer, THDavis, PBurks, TF Topographically designed analogues of [D-Pen,D-Pen5]enkephalin. J Med Chem 34:1823-30 (1991)  
Target
Name:
Delta-type opioid receptor
Synonyms:
DOR-1 MSL-2 OPRD_MOUSE Oprd1
Type:
Enzyme Catalytic Domain
Mol. Mass.:
40577.25
Organism:
MOUSE
Description:
P32300
Residue:
372
  
Inhibitor
Name:
BDBM50453048
Synonyms:
CHEMBL2115042
Type:
Small organic molecule
Emp. Form.:
C31H41N5O7S2
Mol. Mass.:
659.817
SMILES:
[H][C@@]1(NC(=O)CNC(=O)[C@@H](NC(=O)[C@@H](N)Cc2ccc(O)cc2)C(C)(C)SSC(C)(C)[C@H](NC1=O)C(O)=O)[C@H](C)c1ccccc1
: