Target
Sigma non-opioid intracellular receptor 1
Ligand
BDBM50006970
Substrate
Meas. Tech.
ChEMBL_201280 (CHEMBL805614)
Ki
8.3±n/a nM
Citation
 Glennon, RAIsmaiel, AMSmith, JDYousif, Mel-Ashmawy, MHerndon, JLFischer, JBHowie, KJServer, AC Binding of substituted and conformationally restricted derivatives of N-(3-phenyl-n-propyl)-1-phenyl-2-aminopropane at sigma-receptors. J Med Chem 34:1855-9 (1991)  
Target
Name:
Sigma non-opioid intracellular receptor 1
Synonyms:
Aging-associated gene 8 protein SGMR1_HUMAN SIGMAR1 SR31747-binding protein Sigma 1-type opioid receptor Sigma1R | hSigmaR1
Type:
Enzyme Catalytic Domain
Mol. Mass.:
25124.85
Organism:
Homo sapiens (Human)
Description:
Q99720
Residue:
223
  
Inhibitor
Name:
BDBM50006970
Synonyms:
CHEMBL293952 | [2-(4-Iodo-phenyl)-1-methyl-ethyl]-(3-phenyl-propyl)-amine
Type:
Small organic molecule
Emp. Form.:
C18H22IN
Mol. Mass.:
379.2785
SMILES:
CC(Cc1ccc(I)cc1)NCCCc1ccccc1
: