Target
Adenosine deaminase
Ligand
BDBM50012527
Substrate
Meas. Tech.
ChEBML_30795
Ki
5300±n/a nM
Citation
 Cristalli, GVittori, SEleuteri, AGrifantini, MVolpini, RLupidi, GCapolongo, LPesenti, E Purine and 1-deazapurine ribonucleosides and deoxyribonucleosides: synthesis and biological activity. J Med Chem 34:2226-30 (1991)  
Target
Name:
Adenosine deaminase
Synonyms:
ADA Adenosine aminohydrolase
Type:
Enzyme
Mol. Mass.:
40910.44
Organism:
Bos taurus (bovine)
Description:
Residue:
363
  
Inhibitor
Name:
BDBM50012527
Synonyms:
CHEMBL3142249 | N-[3-(4-p-Tolyloxy-5-p-tolyloxymethyl-tetrahydro-furan-2-yl)-3H-imidazo[4,5-b]pyridin-7-yl]-hydroxylamine
Type:
Small organic molecule
Emp. Form.:
C25H26N4O4
Mol. Mass.:
446.4983
SMILES:
Cc1ccc(OC[C@H]2O[C@H](C[C@@H]2Oc2ccc(C)cc2)n2cnc3c(NO)ccnc23)cc1
: