Target
Gag-Pol polyprotein [489-587]
Ligand
BDBM50368642
Substrate
Meas. Tech.
ChEMBL_157875 (CHEMBL763270)
Ki
20±n/a nM
Citation
 Huff, JR HIV protease: a novel chemotherapeutic target for AIDS. J Med Chem 34:2305-14 (1991)  
Target
Name:
Gag-Pol polyprotein [489-587]
Synonyms:
Human immunodeficiency virus type 1 protease Pol polyprotein | gag-pol
Type:
Enzyme Subunit
Mol. Mass.:
10781.16
Organism:
Human immunodeficiency virus type 1
Description:
P04585[489-587]
Residue:
99
  
Inhibitor
Name:
BDBM50368642
Synonyms:
ACETYLPEPSTATIN
Type:
Small organic molecule
Emp. Form.:
C31H57N5O9
Mol. Mass.:
643.8124
SMILES:
CC(C)C[C@H](NC(=O)[C@H](C)NC(=O)C[C@H](O)[C@H](CC(C)C)NC(=O)[C@@H](NC(=O)[C@@H](NC(C)=O)C(C)C)C(C)C)[C@@H](O)CC(O)=O
: