Target
Gag-Pol polyprotein [489-587]
Ligand
BDBM50229341
Substrate
Meas. Tech.
ChEMBL_157875 (CHEMBL763270)
Ki
0.660000±n/a nM
Citation
 Huff, JR HIV protease: a novel chemotherapeutic target for AIDS. J Med Chem 34:2305-14 (1991)  
Target
Name:
Gag-Pol polyprotein [489-587]
Synonyms:
Human immunodeficiency virus type 1 protease Pol polyprotein | gag-pol
Type:
Enzyme Subunit
Mol. Mass.:
10781.16
Organism:
Human immunodeficiency virus type 1
Description:
P04585[489-587]
Residue:
99
  
Inhibitor
Name:
BDBM50229341
Synonyms:
CHEMBL3350610
Type:
Small organic molecule
Emp. Form.:
C43H70N8O10
Mol. Mass.:
859.0635
SMILES:
CC[C@H](C)[C@H](NC(=O)C1CCCN1C[C@H](C)[C@H](Cc1ccccc1)NC(=O)[C@H](CC(N)=O)NC(=O)[C@H](CC(C)C)NC(=O)[C@H](CO)NC(C)=O)C(=O)N[C@@H](C(C)C)C(=O)OC
: