Target
Epidermal growth factor receptor
Ligand
BDBM50229412
Substrate
Meas. Tech.
ChEMBL_66717 (CHEMBL674640)
IC50
500±n/a nM
Citation
 Traxler, PMWacker, OBach, HLGeissler, JFKump, WMeyer, TRegenass, URoesel, JLLydon, N Sulfonylbenzoyl-nitrostyrenes: potential bisubstrate type inhibitors of the EGF-receptor tyrosine protein kinase. J Med Chem 34:2328-37 (1991)  
Target
Name:
Epidermal growth factor receptor
Synonyms:
EGF Receptor Substrate EGFR_HUMAN ERBB1 Epidermal Growth Factor Receptor erbB-1 Epidermal growth factor receptor (EGFR) HER1 Proto-oncogene c-ErbB-1 Tyrosine-Protein Kinase ErbB-1
Type:
Receptor Kinase Domain
Mol. Mass.:
134279.59
Organism:
Homo sapiens (Human)
Description:
P00533
Residue:
1210
  
Inhibitor
Name:
BDBM50229412
Synonyms:
CHEMBL453502
Type:
Small organic molecule
Emp. Form.:
C26H24N6O11S
Mol. Mass.:
628.567
SMILES:
COc1cc(\C=C\[N+]([O-])=O)ccc1OS(=O)(=O)c1ccc(cc1)C(=O)OC[C@H]1O[C@H]([C@H](O)[C@@H]1O)n1cnc2c(N)ncnc12
: