Target
Gag-Pol polyprotein [489-587]
Ligand
BDBM50009323
Substrate
Meas. Tech.
ChEBML_159122
Ki
360±n/a nM
Citation
 Thaisrivongs, STomasselli, AGMoon, JBHui, JMcQuade, TJTurner, SRStrohbach, JWHowe, WJTarpley, WGHeinrikson, RL Inhibitors of the protease from human immunodeficiency virus: design and modeling of a compound containing a dihydroxyethylene isostere insert with high binding affinity and effective antiviral activity. J Med Chem 34:2344-56 (1991)  
Target
Name:
Gag-Pol polyprotein [489-587]
Synonyms:
Human immunodeficiency virus type 1 protease Pol polyprotein | gag-pol
Type:
Enzyme Subunit
Mol. Mass.:
10781.16
Organism:
Human immunodeficiency virus type 1
Description:
P04585[489-587]
Residue:
99
  
Inhibitor
Name:
BDBM50009323
Synonyms:
CHEMBL307682 | N-(2,3-Dihydroxy-1-isobutyl-4-isopropyl-9-methylamino-5-oxo-nonyl)-3-(1H-imidazol-4-yl)-2-(2-phenoxy-acetylamino)-propionamide
Type:
Small organic molecule
Emp. Form.:
C31H49N5O6
Mol. Mass.:
587.7507
SMILES:
CNCCCCC(=O)[C@H](C(C)C)[C@@H](O)[C@H](O)[C@H](CC(C)C)NC(=O)[C@H](Cc1cnc[nH]1)NC(=O)COc1ccccc1
: