Target
D(2) dopamine receptor
Ligand
BDBM50010044
Substrate
Meas. Tech.
ChEMBL_62403 (CHEMBL675728)
Ki
>1000±n/a nM
Citation
 Malleron, JLComte, MTGueremy, CPeyronel, JFTruchon, ABlanchard, JCDoble, APiot, OZundel, JLHuon, C Naphthosultam derivatives: a new class of potent and selective 5-HT2 antagonists. J Med Chem 34:2477-83 (1991)  
Target
Name:
D(2) dopamine receptor
Synonyms:
DOPAMINE D2 DOPAMINE D2 Short Dopamine D2 receptor Drd2
Type:
G Protein-Coupled Receptor (GPCR)
Mol. Mass.:
50931.60
Organism:
Rattus norvegicus (rat)
Description:
P61169
Residue:
444
  
Inhibitor
Name:
BDBM50010044
Synonyms:
2-{3-[4-(4-Fluoro-phenyl)-piperazin-1-yl]-propyl}-2H-naphtho[1,8-cd]isothiazole 1,1-dioxide 2-{3-[4-(4-Fluoro-phenyl)-piperazin-1-yl]-propyl}-2H-naphtho[1,8-cd]isothiazole 1,1-dioxide(Fananserin) ChEMBL_131689 | FANANSERIN
Type:
Small organic molecule
Emp. Form.:
C23H24FN3O2S
Mol. Mass.:
425.519
SMILES:
Fc1ccc(cc1)N1CCN(CCCN2c3cccc4cccc(c34)S2(=O)=O)CC1
: