Target
Serotonin 2 (5-HT2) receptor
Ligand
BDBM50010043
Substrate
Meas. Tech.
ChEMBL_1940 (CHEMBL617547)
IC50
6.3±n/a nM
Citation
 Malleron, JLComte, MTGueremy, CPeyronel, JFTruchon, ABlanchard, JCDoble, APiot, OZundel, JLHuon, C Naphthosultam derivatives: a new class of potent and selective 5-HT2 antagonists. J Med Chem 34:2477-83 (1991)  
Target
Name:
Serotonin 2 (5-HT2) receptor
Synonyms:
5-hydroxytryptamine receptor 2A/2B/2C
Type:
Mol. Mass.:
Description:
ASSAY_ID of ChEMBL is 2197419
Components:
This complex has 3 components.
Component 1
Name:
5-hydroxytryptamine receptor 2B
Synonyms:
5-HT2B 5HT2B_RAT Serotonin 2b (5-HT2b) receptor Srl
Type:
Enzyme Catalytic Domain
Mol. Mass.:
53668.47
Organism:
RAT
Description:
5-HT2B HTR2B RAT::P30994
Residue:
479
  
Component 2
Name:
5-hydroxytryptamine receptor 2C
Synonyms:
5-HT2C 5-hydroxytryptamine receptor 2C (5HT2c) 5ht1c Htr2c Serotonin receptor 2a and 2c (5HT2A and 5HT2C)
Type:
Enzyme
Mol. Mass.:
51935.10
Organism:
Rattus norvegicus (Rat)
Description:
P08909
Residue:
460
  
Component 3
Name:
5-hydroxytryptamine receptor 2A
Synonyms:
5-HT-2A 5-HT2A 5-hydroxytryptamine receptor 2A (5HT2A) Htr2 Serotonin Receptor 2A
Type:
G Protein-Coupled Receptor (GPCR)
Mol. Mass.:
52852.05
Organism:
Rattus norvegicus (rat)
Description:
Rat cortex membranes 5-HT2A receptors.
Residue:
471
  
Inhibitor
Name:
BDBM50010043
Synonyms:
2-[2-(4-Phenyl-3,6-dihydro-2H-pyridin-1-yl)-ethyl]-2H-naphtho[1,8-cd]isothiazole 1,1-dioxide | CHEMBL310105
Type:
Small organic molecule
Emp. Form.:
C23H22N2O2S
Mol. Mass.:
390.498
SMILES:
O=S1(=O)N(CCN2CCC(=CC2)c2ccccc2)c2cccc3cccc1c23
: