Target
Adenosine receptor A2a/A2b
Ligand
BDBM50009528
Substrate
Meas. Tech.
ChEMBL_30534 (CHEMBL643181)
IC50
112±n/a nM
Citation
 Francis, JEWebb, RLGhai, GRHutchison, AJMoskal, MAdeJesus, RYokoyama, RRovinski, SLContardo, NDotson, R Highly selective adenosine A2 receptor agonists in a series of N-alkylated 2-aminoadenosines. J Med Chem 34:2570-9 (1991)  
Target
Name:
Adenosine receptor A2a/A2b
Synonyms:
Adenosine A2 receptor
Type:
Mol. Mass.:
Description:
ASSAY_ID of ChEMBL is 30560
Components:
This complex has 2 components.
Component 1
Name:
Adenosine receptor A2b
Synonyms:
AA2BR_RAT Adora2b
Type:
PROTEIN
Mol. Mass.:
36378.84
Organism:
Rattus norvegicus
Description:
ChEMBL_32934
Residue:
332
  
Component 2
Name:
Adenosine receptor A2a
Synonyms:
AA2AR_RAT Adenosine A2 receptor Adenosine Receptors A2a (A2a) Adenosine receptors A2a Rat striatal adenosine A2a receptor
Type:
G Protein-Coupled Receptor (GPCR)
Mol. Mass.:
45015.65
Organism:
Rattus norvegicus (rat)
Description:
Rat A2A receptors expressed in CHO cells.
Residue:
410
  
Inhibitor
Name:
BDBM50009528
Synonyms:
CHEMBL2374415 | [2-(4-{2-[6-Amino-9-(3,4-dihydroxy-5-hydroxymethyl-tetrahydro-furan-2-yl)-9H-purin-2-ylamino]-ethyl}-phenyl)-ethyl]-phosphonic acid diethyl ester
Type:
Small organic molecule
Emp. Form.:
C20H26N6O4
Mol. Mass.:
414.4582
SMILES:
Nc1nc(NCCCCc2ccccc2)nc2n(cnc12)[C@@H]1O[C@H](CO)[C@@H](O)[C@H]1O
: