Target
Sodium-dependent dopamine transporter
Ligand
BDBM50035738
Substrate
Meas. Tech.
ChEBML_61992
IC50
1.2±n/a nM
Citation
 Carroll, FIGao, YGRahman, MAAbraham, PParham, KLewin, AHBoja, JWKuhar, MJ Synthesis, ligand binding, QSAR, and CoMFA study of 3 beta-(p-substituted phenyl)tropane-2 beta-carboxylic acid methyl esters. J Med Chem 34:2719-25 (1991)  
Target
Name:
Sodium-dependent dopamine transporter
Synonyms:
DA transporter SC6A3_RAT Sodium-dependent dopamine transporter | Sodium-dependent dopamine transporter (DAT)
Type:
Multi-pass membrane protein
Mol. Mass.:
68749.45
Organism:
Rattus norvegicus (rat)
Description:
P23977
Residue:
619
  
Inhibitor
Name:
BDBM50035738
Synonyms:
(R)-3-(4-Chloro-phenyl)-8-methyl-8-aza-bicyclo[3.2.1]octane-2-carboxylic acid methyl ester 3-(4-Fluoro-phenyl)-8-methyl-8-aza-bicyclo[3.2.1]octane-2-carboxylic acid methyl ester | CHEMBL306208
Type:
Small organic molecule
Emp. Form.:
C16H20ClNO2
Mol. Mass.:
293.789
SMILES:
COC(=O)C1C2CCC(CC1c1ccc(Cl)cc1)N2C
: