Target
D(1A) dopamine receptor
Ligand
BDBM50007571
Substrate
Meas. Tech.
ChEMBL_58188 (CHEMBL669843)
IC50
138±n/a nM
Citation
 Caprathe, BWJaen, JCWise, LDHeffner, TGPugsley, TAMeltzer, LTParvez, M Dopamine autoreceptor agonists as potential antipsychotics. 3.6-Propyl-4,5,5a,6,7,8-hexahydrothiazolo[4,5-f]quinolin-2-amine. J Med Chem 34:2736-46 (1991)  
Target
Name:
D(1A) dopamine receptor
Synonyms:
DOPAMINE D1 Dopamine D1 high Dopamine receptor Dopamine1-like Drd1a
Type:
Enzyme Catalytic Domain
Mol. Mass.:
49429.75
Organism:
RAT
Description:
P18901
Residue:
446
  
Inhibitor
Name:
BDBM50007571
Synonyms:
6-Propyl-4,5,5a,6,7,8-hexahydro-thiazolo[4,5-f]quinolin-2-ylamine | CHEMBL91453
Type:
Small organic molecule
Emp. Form.:
C13H19N3S
Mol. Mass.:
249.375
SMILES:
CCCN1CCC=C2C1CCc1sc(N)nc21
: