Target
Sodium-dependent dopamine transporter
Ligand
BDBM50008045
Substrate
Meas. Tech.
ChEBML_62000
IC50
211±n/a nM
Citation
 Lewin, AHGao, YGAbraham, PBoja, JWKuhar, MJCarroll, FI 2 beta-substituted analogues of cocaine. Synthesis and inhibition of binding to the cocaine receptor. J Med Chem 35:135-40 (1992)  
Target
Name:
Sodium-dependent dopamine transporter
Synonyms:
DA transporter SC6A3_RAT Sodium-dependent dopamine transporter | Sodium-dependent dopamine transporter (DAT)
Type:
Multi-pass membrane protein
Mol. Mass.:
68749.45
Organism:
Rattus norvegicus (rat)
Description:
P23977
Residue:
619
  
Inhibitor
Name:
BDBM50008045
Synonyms:
3-Benzoyloxy-8-methyl-8-aza-bicyclo[3.2.1]octane-2-carboxylic acid isopropyl ester; hydrochloride | CHEMBL545395
Type:
Small organic molecule
Emp. Form.:
C19H25NO4
Mol. Mass.:
331.4061
SMILES:
CC(C)OC(=O)C1C2CC[C@H](C[C@@H]1OC(=O)c1ccccc1)N2C
: