Target
Sodium-dependent dopamine transporter
Ligand
BDBM50419747
Substrate
Meas. Tech.
ChEMBL_61994 (CHEMBL670104)
IC50
21200±n/a nM
Citation
 Abraham, PPitner, JBLewin, AHBoja, JWKuhar, MJCarroll, FI N-modified analogues of cocaine: synthesis and inhibition of binding to the cocaine receptor. J Med Chem 35:141-4 (1992)  
Target
Name:
Sodium-dependent dopamine transporter
Synonyms:
DA transporter SC6A3_RAT Sodium-dependent dopamine transporter | Sodium-dependent dopamine transporter (DAT)
Type:
Multi-pass membrane protein
Mol. Mass.:
68749.45
Organism:
Rattus norvegicus (rat)
Description:
P23977
Residue:
619
  
Inhibitor
Name:
BDBM50419747
Synonyms:
CHEMBL1947052
Type:
Small organic molecule
Emp. Form.:
C15H19NO2
Mol. Mass.:
245.3169
SMILES:
CN1[C@H]2CC[C@@H]1C[C@H](C2)OC(=O)c1ccccc1
: